WarmFuzzy hugo1301 at
Mon Jan 1 00:51:05 PST 2001

>I'm trying to compile Filutils. It ends with the below:
>In file included from safe-read.c:26:
>/usr/include/unistd.h:199: No include path in which to find stddef.h
>make[2] *** [safe-read.o] Error 1
>make[2] leaving directory '/usr/src/fileutils-4.0/lib'
>make[1] *** [all-recursive] Error 1
>make[1] leaving directory '/usr/src/fileutils-4.0'
>make: *** [all-recursive-am] Error 2

I downloaded Fileutils-4.0z and it compiled without a whimper.


Unsubscribe: send email to lfs-discuss-request at
and put unsubscribe in the subject header of the message

More information about the lfs-dev mailing list