kdemultimedia-3.5.0 install problems

lux-integ lux-integ at btconnect.com
Tue Jan 31 08:39:26 PST 2006


Greetings,

I am having dificulty installing kdemultimedia-3.5.0.  These problems are 
reported in  the attached file.

Helpful sugestions will be appreciated.

yours sncerely

lux-integ.
-------------- next part --------------

make fails with kdemultimedia-3.5.0.  The kernel is 2.6.14.2, CPU is  duron 850  (Previously arts-1.5.0, kdelibs-3.5.0, kdebase-3.5.0 and kdepim-3.5.0 all installed.  I zlso installed  -the previously uninstallable libtunepimp-0.3.0 inserting the signal.h neader as suggested on  this list).  the  steps  then  followed  for kdemultimedia-3.5.0 are below.


#=========first  installation of akode


I used 30375-akode-2.0rc1.tar.gz

here is the configured options   

./configure --prefix=$KDE_PREFIX 

it compiles and installs normally.


#=======secondly installation of kdemultimedia-3.5.0:
(a) here is my configure options: 

./configure   --prefix=$KDE_PREFIX     --disable-dependency-tracking --disable-debug    --enable-qtopia --enable-kscd-defaults    --with-PACKAGE=$PKG_CONFIG_PATH  --with-qt-dir=/opt/qt-3.3.4   --with-qt-includes=/opt/qt-3.3.4/include   --with-qt-libraries=/opt/qt-3.3.4/lib       --with-cdparanoia     --with-xine

 configure runs ok,  no reports of missing  dependencies as shown below:

fast creating oggvorbis_artsplugin/Makefile
fast creating xine_artsplugin/Makefile
fast creating xine_artsplugin/tools/Makefile
fast creating xine_artsplugin/tools/thumbnail/Makefile
config.pl: fast created 162 file(s).
config.status: creating config.h
config.status: executing depfiles commands
config.status: executing default-1 commands

Good - your configure finished. Start make now



(b)  but the compile fails as shows below:


/opt/kde-3.5.0/include/arts/core.h:350: error: `assert' undeclared (first use this function)
In file included from /opt/kde-3.5.0/include/arts/core.h:401,
                 from /opt/kde-3.5.0/include/arts/common.h:51,
                 from artsbuilder.h:6,
                 from artsbuilder.cc:3:
/opt/kde-3.5.0/include/arts/reference.h: In member function `Arts::Buffer* Arts::Object::_allocCustomMessage(
long int) const':
/opt/kde-3.5.0/include/arts/reference.h:209: error: `assert' undeclared (first use this function)
/opt/kde-3.5.0/include/arts/reference.h: In member function `void Arts::Object::_sendCustomMessage(Arts::Buff
er*) const':
;;
;;
artsbuilder.cc:2935: error: `assert' undeclared (first use this function)
make[2]: *** [artsbuilder.lo] Error 1   

====================

helpful suggestions will be appreciated




More information about the blfs-support mailing list